Reaction Details
TargetFatty acid-binding protein, liver
LigandBDBM119875
Substrate/Competitorn/a
Meas. Tech.ANS Fluorescence Displacement Assay
Ki 37± 2 nM
Citation Martin, GGMcIntosh, ALHuang, HGupta, SAtshaves, BPLandrock, KKLandrock, DKier, ABSchroeder, F The human liver fatty acid binding protein T94A variant alters the structure, stability, and interaction with fibrates. Biochemistry52:9347-57 (2013) 
 
Fatty acid-binding protein, liver
Name:Fatty acid-binding protein, liver
Type:Protein
Mol. Mass.:14274.39
Organism:Rattus norvegicus (Rat)
Description:rat L-FABP
Residue:127
BDBM119875
NameBDBM119875
Synonyms:3,7,11,15-tetramethylhexadecanoic acid | Phytanic acid
TypeSmall organic molecule
Emp. Form.C20H40O2
Mol. Mass.312.5304
SMILESCC(C)CCCC(C)CCCC(C)CCCC(C)CC(O)=O