Reaction Details
TargetFatty acid-binding protein, liver
LigandBDBM50085042
Substrate/Competitorn/a
Meas. Tech.ANS Fluorescence Displacement Assay
Ki 1.0e+2± 1e+1 nM
Citation Martin, GGMcIntosh, ALHuang, HGupta, SAtshaves, BPLandrock, KKLandrock, DKier, ABSchroeder, F The human liver fatty acid binding protein T94A variant alters the structure, stability, and interaction with fibrates. Biochemistry52:9347-57 (2013) 
 
Fatty acid-binding protein, liver
Name:Fatty acid-binding protein, liver
Type:Protein
Mol. Mass.:14274.39
Organism:Rattus norvegicus (Rat)
Description:rat L-FABP
Residue:127
BDBM50085042
NameBDBM50085042
Synonyms:2-(4-(4-Chlorobenzoyl)phenoxy)-2-methylpropanoic acid 1-methylethyl ester FENOFIBRATE Fenofibric acid Isopropyl (4'-(p-chlorobenzoyl)-2-phenoxy-2-methyl)propionate Lipantil (TN) Tricor (TN) | propan-2-yl 2-[4-(4-chlorobenzoyl)phenoxy]-2-methylpropanoate
TypeSmall organic molecule
Emp. Form.C20H21ClO4
Mol. Mass.360.831
SMILESCC(C)OC(=O)C(C)(C)Oc1ccc(cc1)C(=O)c1ccc(Cl)cc1