Reaction Details
TargetN-lysine methyltransferase SMYD2
LigandBDBM50181508
Substrate/Competitorn/a
Meas. Tech.Cell-Based Assay for Detection of SMYD2 Methylation Activity
IC50 46.7±n/a nM
Citation Mowat, JSStellfeld, TStresemann, CHillig, RKöhr, SStöckigt, DWeiske, JBrumby, TBarak, NChrist, CTer Laak, ABadock, VCrampton, RHStefanuti, I Aryl-cyanoguanidine compounds US Patent US10023539 Publication Date 7/17/2018
 
N-lysine methyltransferase SMYD2
Name:N-lysine methyltransferase SMYD2
Type:Enzyme
Mol. Mass.:49689.57
Organism:Homo sapiens (Human)
Description:Q9NRG4
Residue:433
BDBM50181508
NameBDBM50181508
Synonyms:CHEMBL3818083 | US10023539, Example 4.2
TypeSmall organic molecule
Emp. Form.C22H20Cl2F2N6O3
Mol. Mass.525.335
SMILESCCN(C1CN(N=C1c1ccc(Cl)c(Cl)c1)C(\Nc1cccc(OC(F)F)c1)=N/C#N)C(=O)CO