Reaction Details
TargetN-lysine methyltransferase SMYD2
LigandBDBM283143
Substrate/Competitorn/a
Meas. Tech.Cell-Based Assay for Detection of SMYD2 Methylation Activity
IC50 2.64±n/a nM
Citation Mowat, JSStellfeld, TStresemann, CHillig, RKöhr, SStöckigt, DWeiske, JBrumby, TBarak, NChrist, CTer Laak, ABadock, VCrampton, RHStefanuti, I Aryl-cyanoguanidine compounds US Patent US10023539 Publication Date 7/17/2018
 
N-lysine methyltransferase SMYD2
Name:N-lysine methyltransferase SMYD2
Type:Enzyme
Mol. Mass.:49689.57
Organism:Homo sapiens (Human)
Description:Q9NRG4
Residue:433
BDBM283143
NameBDBM283143
Synonyms:(2R)—N-[1-{N′-cyano-N-[3-(difluoromethoxy)phenyl]carbamimidoyl}-3-(3,4-dichlorophenyl)-4,5-dihydro-1H-pyrazol-4-yl]-N-ethyl-2-hydroxypropanamide (1:1 Mixture of Diastereomers) | US10023539, Example 9
TypeSmall organic molecule
Emp. Form.C23H22Cl2F2N6O3
Mol. Mass.539.362
SMILESCCN(C1CN(N=C1c1ccc(Cl)c(Cl)c1)C(\Nc1cccc(OC(F)F)c1)=N/C#N)C(=O)[C@@H](C)O