Reaction Details
TargetN-lysine methyltransferase SMYD2
LigandBDBM283168
Substrate/Competitorn/a
Meas. Tech.Scintillation Proximity Assay (SPA) for Detection of SMYD2 Enzymatic Inhibition
pH9±n/a
IC50 59.5±n/a nM
Commentsextracted
Citation Mowat, JSStellfeld, TStresemann, CHillig, RKöhr, SStöckigt, DWeiske, JBrumby, TBarak, NChrist, CTer Laak, ABadock, VCrampton, RHStefanuti, I Aryl-cyanoguanidine compounds US Patent US10023539 Publication Date 7/17/2018
 
N-lysine methyltransferase SMYD2
Name:N-lysine methyltransferase SMYD2
Type:Enzyme
Mol. Mass.:49689.57
Organism:Homo sapiens (Human)
Description:Q9NRG4
Residue:433
BDBM283168
NameBDBM283168
Synonyms:Rac-N-[1-(N′-cyano-N-{3-[2-(dimethylamino)ethoxy]phenyl}carbamimidoyl)-3-(3,4-dichlorophenyl)-4,5-dihydro-1H-pyrazol-4-yl]-N-ethylglycinamide | US10023539, Example 17
TypeSmall organic molecule
Emp. Form.C25H30Cl2N8O2
Mol. Mass.545.464
SMILESCCN(C1CN(N=C1c1ccc(Cl)c(Cl)c1)C(\Nc1cccc(OCCN(C)C)c1)=N/C#N)C(=O)CN