Reaction Details
TargetN-lysine methyltransferase SMYD2
LigandBDBM283195
Substrate/Competitorn/a
Meas. Tech.Scintillation Proximity Assay (SPA) for Detection of SMYD2 Enzymatic Inhibition
pH9±n/a
IC50 15.8±n/a nM
Commentsextracted
Citation Mowat, JSStellfeld, TStresemann, CHillig, RKöhr, SStöckigt, DWeiske, JBrumby, TBarak, NChrist, CTer Laak, ABadock, VCrampton, RHStefanuti, I Aryl-cyanoguanidine compounds US Patent US10023539 Publication Date 7/17/2018
 
N-lysine methyltransferase SMYD2
Name:N-lysine methyltransferase SMYD2
Type:Enzyme
Mol. Mass.:49689.57
Organism:Homo sapiens (Human)
Description:Q9NRG4
Residue:433
BDBM283195
NameBDBM283195
Synonyms:Rac-N-[r-(N′-cyano-N-[2-[2-(pyrrolidin-1-yl)ethoxy]-5-(trifluormethyl)phenyl]carbamimidoyl)-3-(3,4-dichlorophenyl)-4,5-dihydro-1H-pyrazol-4-yl]-N-ethyl-2-hydroxyacetamide | US10023539, Example 30
TypeSmall organic molecule
Emp. Form.C28H30Cl2F3N7O3
Mol. Mass.640.484
SMILESCCN(C1CN(N=C1c1ccc(Cl)c(Cl)c1)C(\Nc1cc(ccc1OCCN1CCCC1)C(F)(F)F)=N/C#N)C(=O)CO