Reaction Details
TargetN-lysine methyltransferase SMYD2
LigandBDBM50180974
Substrate/Competitorn/a
Meas. Tech.Scintillation Proximity Assay (SPA) for Detection of SMYD2 Enzymatic Inhibition
pH9±n/a
IC50 37.6±n/a nM
Commentsextracted
Citation Mowat, JSStellfeld, TStresemann, CHillig, RKöhr, SStöckigt, DWeiske, JBrumby, TBarak, NChrist, CTer Laak, ABadock, VCrampton, RHStefanuti, I Aryl-cyanoguanidine compounds US Patent US10023539 Publication Date 7/17/2018
 
N-lysine methyltransferase SMYD2
Name:N-lysine methyltransferase SMYD2
Type:Enzyme
Mol. Mass.:49689.57
Organism:Homo sapiens (Human)
Description:Q9NRG4
Residue:433
BDBM50180974
NameBDBM50180974
Synonyms:CHEMBL3818092 | US10023539, Example 33.2
TypeSmall organic molecule
Emp. Form.C23H23ClF2N6O3
Mol. Mass.504.917
SMILESCCN(C1CN(N=C1c1ccc(Cl)c(C)c1)C(\Nc1cccc(OC(F)F)c1)=N/C#N)C(=O)CO