Reaction Details
TargetN-lysine methyltransferase SMYD2
LigandBDBM283209
Substrate/Competitorn/a
Meas. Tech.Scintillation Proximity Assay (SPA) for Detection of SMYD2 Enzymatic Inhibition
pH9±n/a
IC50 37.5±n/a nM
Commentsextracted
Citation Mowat, JSStellfeld, TStresemann, CHillig, RKöhr, SStöckigt, DWeiske, JBrumby, TBarak, NChrist, CTer Laak, ABadock, VCrampton, RHStefanuti, I Aryl-cyanoguanidine compounds US Patent US10023539 Publication Date 7/17/2018
 
N-lysine methyltransferase SMYD2
Name:N-lysine methyltransferase SMYD2
Type:Enzyme
Mol. Mass.:49689.57
Organism:Homo sapiens (Human)
Description:Q9NRG4
Residue:433
BDBM283209
NameBDBM283209
Synonyms:N-[1-{N′-cyano-N-[3-(difluoromethoxy)phenyl]carbamimidoyl}-3-(3,4-dichlorophenyl)-4,5-dihydro-1H-pyrazol-4-yl]-3-methyl-D-isovalinamide Isomer 2 US10023539, Example 38.2
TypeSmall organic molecule
Emp. Form.C24H25Cl2F2N7O2
Mol. Mass.552.404
SMILESCC(C)[C@@](C)(N)C(=O)NC1CN(N=C1c1ccc(Cl)c(Cl)c1)C(\Nc1cccc(OC(F)F)c1)=N/C#N