Reaction Details
TargetRho-associated protein kinase 2
LigandBDBM119954
Substrate/Competitorn/a
Meas. Tech.IMAP Assay
pH7.2±n/a
IC50 0.45±n/a nM
Citation Cook, BNKowalski, JALi, XMarshall, DRSchlyer, SSibley, RSmith-Keenan, LLSoleymanzadeh, FSorcek, RJYoung, ERZhang, Y Rho kinase inhibitors US Patent US8697911 Publication Date 4/15/2014
 
Rho-associated protein kinase 2
Name:Rho-associated protein kinase 2
Type:Protein
Mol. Mass.:160885.43
Organism:Homo sapiens (Human)
Description:O75116
Residue:1388
BDBM119954
NameBDBM119954
Synonyms:US8697911, 114
TypeSmall organic molecule
Emp. Form.C23H21N5O3S2
Mol. Mass.479.575
SMILESCN1CCc2nc(NC(=O)c3cccc(CNC(=O)c4ccc(s4)-c4cnco4)c3)sc2C1