Reaction Details
TargetRho-associated protein kinase 2
LigandBDBM119969
Substrate/Competitorn/a
Meas. Tech.IMAP Assay
pH7.2±n/a
IC50 0.24±n/a nM
Citation Cook, BNKowalski, JALi, XMarshall, DRSchlyer, SSibley, RSmith-Keenan, LLSoleymanzadeh, FSorcek, RJYoung, ERZhang, Y Rho kinase inhibitors US Patent US8697911 Publication Date 4/15/2014
 
Rho-associated protein kinase 2
Name:Rho-associated protein kinase 2
Type:Protein
Mol. Mass.:160885.43
Organism:Homo sapiens (Human)
Description:O75116
Residue:1388
BDBM119969
NameBDBM119969
Synonyms:US8697911, 134
TypeSmall organic molecule
Emp. Form.C27H28N6O2S
Mol. Mass.500.615
SMILESCN(C)[C@H]1CCc2nc(NC(=O)c3cccc(CNC(=O)c4ccc(cc4)-n4ccnc4)c3)sc2C1