Reaction Details
TargetRho-associated protein kinase 2
LigandBDBM119977
Substrate/Competitorn/a
Meas. Tech.IMAP Assay
pH7.2±n/a
IC50 0.52±n/a nM
Citation Cook, BNKowalski, JALi, XMarshall, DRSchlyer, SSibley, RSmith-Keenan, LLSoleymanzadeh, FSorcek, RJYoung, ERZhang, Y Rho kinase inhibitors US Patent US8697911 Publication Date 4/15/2014
 
Rho-associated protein kinase 2
Name:Rho-associated protein kinase 2
Type:Protein
Mol. Mass.:160885.43
Organism:Homo sapiens (Human)
Description:O75116
Residue:1388
BDBM119977
NameBDBM119977
Synonyms:US8697911, 148
TypeSmall organic molecule
Emp. Form.C28H27N7O3S
Mol. Mass.541.624
SMILESO=C(NCc1cccc(c1)C(=O)Nc1nc2CC[C@@H](Cc2s1)N1CCOCC1)c1cn2ccc(cc2n1)C#N