Reaction Details
TargetRho-associated protein kinase 2
LigandBDBM119979
Substrate/Competitorn/a
Meas. Tech.IMAP Assay
pH7.2±n/a
IC50 0.57±n/a nM
Citation Cook, BNKowalski, JALi, XMarshall, DRSchlyer, SSibley, RSmith-Keenan, LLSoleymanzadeh, FSorcek, RJYoung, ERZhang, Y Rho kinase inhibitors US Patent US8697911 Publication Date 4/15/2014
 
Rho-associated protein kinase 2
Name:Rho-associated protein kinase 2
Type:Protein
Mol. Mass.:160885.43
Organism:Homo sapiens (Human)
Description:O75116
Residue:1388
BDBM119979
NameBDBM119979
Synonyms:US8697911, 152
TypeSmall organic molecule
Emp. Form.C25H28N10O4S
Mol. Mass.564.619
SMILESCc1c(nnn1-c1nonc1N)C(=O)NCc1cccc(c1)C(=O)Nc1nc2CC[C@@H](Cc2s1)N1CCOCC1