Reaction Details
TargetRho-associated protein kinase 2
LigandBDBM119982
Substrate/Competitorn/a
Meas. Tech.IMAP Assay
pH7.2±n/a
IC50 0.43±n/a nM
Citation Cook, BNKowalski, JALi, XMarshall, DRSchlyer, SSibley, RSmith-Keenan, LLSoleymanzadeh, FSorcek, RJYoung, ERZhang, Y Rho kinase inhibitors US Patent US8697911 Publication Date 4/15/2014
 
Rho-associated protein kinase 2
Name:Rho-associated protein kinase 2
Type:Protein
Mol. Mass.:160885.43
Organism:Homo sapiens (Human)
Description:O75116
Residue:1388
BDBM119982
NameBDBM119982
Synonyms:US8697911, 162
TypeSmall organic molecule
Emp. Form.C29H29N5O4S
Mol. Mass.543.637
SMILESO=C(NCc1cccc(c1)C(=O)Nc1nc2CC[C@@H](Cc2s1)N1CCOCC1)c1ccc(cc1)-c1cnco1