Reaction Details
TargetMitogen-activated protein kinase 1
LigandBDBM120107
Substrate/Competitorn/a
Meas. Tech.Enzymatic Assay
pH7.3±n/a
IC50 3.8±n/a nM
Commentsextracted
Citation Blake, JFChicarelli, MJGarrey, RFGaudino, JGrina, JMoreno, DAMohr, PJRen, LSchwarz, JChen, HRobarge, KZhou, A Serine/threonine kinase inhibitors US Patent US8697715 Publication Date 4/15/2014
 
Mitogen-activated protein kinase 1
Name:Mitogen-activated protein kinase 1
Type:Ser/Thr Protein Kinase
Mol. Mass.:41392.76
Organism:Homo sapiens (Human)
Description:P28482
Residue:360
BDBM120107
NameBDBM120107
Synonyms:US8697715, 120 | US9259470, 120
TypeSmall organic molecule
Emp. Form.C22H22ClFN4O3
Mol. Mass.444.886
SMILESOCC(c1cc(F)cc(Cl)c1)n1ccc(cc1=O)-c1ccnc(NC2CCOCC2)n1