Reaction Details
TargetNon-receptor tyrosine-protein kinase TYK2
LigandBDBM120133
Substrate/Competitorn/a
Meas. Tech.Inhibition Assay
pH7.2±n/a
Temperature295.15±n/a K
Ki 1±n/a nM
Commentsextracted
Citation Blench, TJEllwood, CGoodacre, SCLai, YLiang, JMacleod, CMagnuson, SRTsui, VHWilliams, KZhang, B Azabenzothiazole compounds, compositions and methods of use US Patent US8697708 Publication Date 4/15/2014
 
Non-receptor tyrosine-protein kinase TYK2
Name:Non-receptor tyrosine-protein kinase TYK2
Type:Protein
Mol. Mass.:133666.03
Organism:Homo sapiens (Human)
Description:P29597
Residue:1187
BDBM120133
NameBDBM120133
Synonyms:US8697708, 22
TypeSmall organic molecule
Emp. Form.C18H13Cl2N5OS
Mol. Mass.418.3
SMILESCc1cc(Nc2nccc3nc(sc23)-c2c(Cl)cc(CO)cc2Cl)ncn1