Reaction Details
TargetGamma-aminobutyric acid receptor subunit alpha-5
LigandBDBM120144
Substrate/Competitorn/a
Meas. Tech.Radioligand Binding Assay
pH7.5±n/a
Temperature277.15±n/a K
Ki 28.8±n/a nM
Commentsextracted
Citation Gabriel, SDThomas, A Triazole compounds II US Patent US8697696 Publication Date 4/15/2014
 
Gamma-aminobutyric acid receptor subunit alpha-5
Name:Gamma-aminobutyric acid receptor subunit alpha-5
Type:Enzyme
Mol. Mass.:52160.59
Organism:Homo sapiens (Human)
Description:P31644
Residue:462
BDBM120144
NameBDBM120144
Synonyms:US8697696, 1
TypeSmall organic molecule
Emp. Form.C19H20FN5O4
Mol. Mass.401.3916
SMILESCn1nnc(c1COc1cc(on1)C(=O)NC1CCOCC1)-c1ccc(F)cc1