Reaction Details
TargetGamma-aminobutyric acid receptor subunit alpha-5
LigandBDBM120149
Substrate/Competitorn/a
Meas. Tech.Radioligand Binding Assay
pH7.5±n/a
Temperature277.15±n/a K
Ki 11.3±n/a nM
Commentsextracted
Citation Gabriel, SDThomas, A Triazole compounds II US Patent US8697696 Publication Date 4/15/2014
 
Gamma-aminobutyric acid receptor subunit alpha-5
Name:Gamma-aminobutyric acid receptor subunit alpha-5
Type:Enzyme
Mol. Mass.:52160.59
Organism:Homo sapiens (Human)
Description:P31644
Residue:462
BDBM120149
NameBDBM120149
Synonyms:US8697696, 6
TypeSmall organic molecule
Emp. Form.C19H20FN5OS
Mol. Mass.385.458
SMILESCC(C)NC(=O)c1sc(\C=C\c2c(nnn2C)-c2ccc(F)cc2)nc1C