Reaction Details
TargetStromelysin-2
LigandBDBM120158
Substrate/Competitorn/a
Meas. Tech.Inhibition Assay
Ki 489±n/a nM
Citation Devel, LBeau, FCzarny, BDive, V Pseudodipeptides as MMP inhibitors US Patent US8691753 Publication Date 4/8/2014
 
Stromelysin-2
Name:Stromelysin-2
Type:Enzyme
Mol. Mass.:54143.02
Organism:Homo sapiens (Human)
Description:P09238
Residue:476
BDBM120158
NameBDBM120158
Synonyms:US8691753, 6
TypeSmall organic molecule
Emp. Form.C28H29ClN4O8
Mol. Mass.585.005
SMILESNC(=O)[C@H](CCC(O)=O)NC(=O)[C@@H](CCC(O)=O)NC(=O)CCc1cc(no1)-c1ccc(cc1)-c1cccc(Cl)c1