Reaction Details
TargetStromelysin-2
LigandBDBM120213
Substrate/Competitorn/a
Meas. Tech.Inhibition Assay
Ki 102±n/a nM
Citation Devel, LBeau, FCzarny, BDive, V Pseudodipeptides as MMP inhibitors US Patent US8691753 Publication Date 4/8/2014
 
Stromelysin-2
Name:Stromelysin-2
Type:Enzyme
Mol. Mass.:54143.02
Organism:Homo sapiens (Human)
Description:P09238
Residue:476
BDBM120213
NameBDBM120213
Synonyms:US8691753, 62
TypeSmall organic molecule
Emp. Form.C31H34N4O6
Mol. Mass.558.6249
SMILESNC(=O)CC[C@H](NC(=O)[C@H](CCC(O)=O)NC(=O)CCc1ccc(cc1)-c1ccc(cc1)-c1ccccc1)C(N)=O