Reaction Details
TargetStromelysin-2
LigandBDBM120219
Substrate/Competitorn/a
Meas. Tech.Inhibition Assay
Ki 71±n/a nM
Citation Devel, LBeau, FCzarny, BDive, V Pseudodipeptides as MMP inhibitors US Patent US8691753 Publication Date 4/8/2014
 
Stromelysin-2
Name:Stromelysin-2
Type:Enzyme
Mol. Mass.:54143.02
Organism:Homo sapiens (Human)
Description:P09238
Residue:476
BDBM120219
NameBDBM120219
Synonyms:US8691753, 68
TypeSmall organic molecule
Emp. Form.C29H31N3O6
Mol. Mass.517.5729
SMILESNC(=O)[C@H](CO)NC(=O)[C@H](CCC(O)=O)NC(=O)CCc1ccc(cc1)-c1ccc(cc1)-c1ccccc1