Reaction Details
TargetStromelysin-2
LigandBDBM120234
Substrate/Competitorn/a
Meas. Tech.Inhibition Assay
Ki 435±n/a nM
Citation Devel, LBeau, FCzarny, BDive, V Pseudodipeptides as MMP inhibitors US Patent US8691753 Publication Date 4/8/2014
 
Stromelysin-2
Name:Stromelysin-2
Type:Enzyme
Mol. Mass.:54143.02
Organism:Homo sapiens (Human)
Description:P09238
Residue:476
BDBM120234
NameBDBM120234
Synonyms:US8691753, 83
TypeSmall organic molecule
Emp. Form.C22H25N3O7S
Mol. Mass.475.515
SMILESNC(=O)[C@H](CC(O)=O)NC(=O)[C@H](CCC(O)=O)NC(=O)CCc1ccc(cc1)-c1cccs1