Reaction Details
TargetMacrophage metalloelastase
LigandBDBM120168
Substrate/Competitorn/a
Meas. Tech.Inhibition Assay
Ki 3.4±n/a nM
Citation Devel, LBeau, FCzarny, BDive, V Pseudodipeptides as MMP inhibitors US Patent US8691753 Publication Date 4/8/2014
 
Macrophage metalloelastase
Name:Macrophage metalloelastase
Type:Enzyme
Mol. Mass.:54012.99
Organism:Homo sapiens (Human)
Description:P39900
Residue:470
BDBM120168
NameBDBM120168
Synonyms:US8691753, 16
TypeSmall organic molecule
Emp. Form.C27H30N4O6
Mol. Mass.506.5503
SMILESCC[C@H](NC(=O)CCc1cc(no1)-c1ccc(cc1)-c1ccccc1)C(=O)N[C@@H](CCC(O)=O)C(N)=O