Reaction Details
TargetMacrophage metalloelastase
LigandBDBM120217
Substrate/Competitorn/a
Meas. Tech.Inhibition Assay
Ki 2.2±n/a nM
Citation Devel, LBeau, FCzarny, BDive, V Pseudodipeptides as MMP inhibitors US Patent US8691753 Publication Date 4/8/2014
 
Macrophage metalloelastase
Name:Macrophage metalloelastase
Type:Enzyme
Mol. Mass.:54012.99
Organism:Homo sapiens (Human)
Description:P39900
Residue:470
BDBM120217
NameBDBM120217
Synonyms:US8691753, 66
TypeSmall organic molecule
Emp. Form.C29H31N3O5
Mol. Mass.501.5735
SMILESC[C@H](NC(=O)[C@H](CCC(O)=O)NC(=O)CCc1ccc(cc1)-c1ccc(cc1)-c1ccccc1)C(N)=O