Reaction Details
TargetMacrophage metalloelastase
LigandBDBM120258
Substrate/Competitorn/a
Meas. Tech.Inhibition Assay
Ki 0.3±n/a nM
Citation Devel, LBeau, FCzarny, BDive, V Pseudodipeptides as MMP inhibitors US Patent US8691753 Publication Date 4/8/2014
 
Macrophage metalloelastase
Name:Macrophage metalloelastase
Type:Enzyme
Mol. Mass.:54012.99
Organism:Homo sapiens (Human)
Description:P39900
Residue:470
BDBM120258
NameBDBM120258
Synonyms:US8691753, 95 bis
TypeSmall organic molecule
Emp. Form.C31H33N3O9S
Mol. Mass.623.673
SMILESNC(=O)[C@H](CCC(O)=O)NC(=O)[C@H](CCC(O)=O)NC(=O)[C@@H](CC(O)=O)Cc1ccc(cc1)-c1cc(cs1)-c1ccccc1