Reaction Details
TargetAcetylcholinesterase
LigandBDBM50241461
Substrate/Competitorn/a
Meas. Tech.Assay of Substrate Hydrolysis
pH7±n/a
Temperature298.15±n/a K
Ki 110±0.0 nM
CommentsP-site specific extracted
Citation Beri, VWildman, SAShiomi, KAl-Rashid, ZFCheung, JRosenberry, TL The natural product dihydrotanshinone I provides a prototype for uncharged inhibitors that bind specifically to the acetylcholinesterase peripheral site with nanomolar affinity. Biochemistry52:7486-99 (2013) 
 
Acetylcholinesterase
Name:Acetylcholinesterase
Type:Enzyme
Mol. Mass.:67792.70
Organism:Homo sapiens (Human)
Description:P22303
Residue:614
BDBM50241461
NameBDBM50241461
Synonyms:3,7-bis(dimethylamino)phenothiazin-5-ium chloride CHEMBL405110 Methylene Blue anhydrous Methylene blue (10) azul de metileno cid_6099 | methylthioninium chloride
TypeSmall organic molecule
Emp. Form.C16H18N3S
Mol. Mass.284.399
SMILESCN(C)c1ccc2nc3ccc(cc3sc2c1)=[N+](C)C