Reaction Details
TargetDihydroorotate dehydrogenase (quinone), mitochondrial
LigandBDBM120315
Substrate/Competitorn/a
Meas. Tech.Enzymatic Assays
IC50 56±n/a nM
Citation Bastos, CBooker, MLCelatka, CAClardy, JCCortese, JPatel, VPSkerlj, RWiegand, RCWirth, DF Small molecule inhibitors of Plasmodium falciparum dihydroorotate dehydrogenase US Patent US8703811 Publication Date 4/22/2014
 
Dihydroorotate dehydrogenase (quinone), mitochondrial
Name:Dihydroorotate dehydrogenase (quinone), mitochondrial
Type:Enzyme
Mol. Mass.:65581.88
Organism:Plasmodium falciparum
Description:His6-tag DHODH was expressed in E. coli.
Residue:569
BDBM120315
NameBDBM120315
Synonyms:US8703811, 55
TypeSmall organic molecule
Emp. Form.C14H12ClN3OS
Mol. Mass.305.783
SMILESCCNC(=O)c1ccc(s1)-n1cnc2cc(Cl)ccc12