Reaction Details
TargetTyrosine-protein kinase BTK
LigandBDBM120743
Substrate/Competitorn/a
Meas. Tech.Time Resolved-FRET Assay
Temperature298.15±n/a K
IC50 126±n/a nM
Commentsextracted
Citation Bearss, DJVankayalapati, HSorna, VWarner, SLSharma, S Substituted N-(3-(pyrimidin-4-yl)phenyl)acrylamide analogs as tyrosine receptor kinase BTK inhibitors US Patent US8703767 Publication Date 4/22/2014
 
Tyrosine-protein kinase BTK
Name:Tyrosine-protein kinase BTK
Type:Enzyme
Mol. Mass.:76289.95
Organism:Homo sapiens (Human)
Description:Q06187
Residue:659
BDBM120743
NameBDBM120743
Synonyms:US8703767, 3
TypeSmall organic molecule
Emp. Form.C24H22FN7O2
Mol. Mass.459.4756
SMILESFc1cc(Nc2nc(-c3cccc(NC(=O)C=C)c3)c3c[nH]nc3n2)ccc1N1CCOCC1