Reaction Details
TargetPlasma kallikrein
LigandBDBM283368
Substrate/Competitorn/a
Meas. Tech.In Vitro Contact Cellular Assay
EC50<100±n/a nM
Citation McDonald, AQian, S Therapeutic inhibitory compounds US Patent US10023557 Publication Date 7/17/2018
 
Plasma kallikrein
Name:Plasma kallikrein
Type:Protein
Mol. Mass.:71391.16
Organism:Homo sapiens (Human)
Description:P03952
Residue:638
BDBM283368
NameBDBM283368
Synonyms:N-((5-chloro-1H-indazol-3-yl)methyl)-2-((3- methyl-8-(methylsulfonyl)quinolin-6- yl)methyl)isonicotinamide US10266515, Example 20 US11021463, Example 20 | US9611252, Example 20
TypeSmall organic molecule
Emp. Form.C26H22ClN5O3S
Mol. Mass.520.003
SMILESCc1cnc2c(cc(Cc3cc(ccn3)C(=O)NCc3n[nH]c4ccc(Cl)cc34)cc2c1)S(C)(=O)=O