Reaction Details
TargetPlasma kallikrein
LigandBDBM283379
Substrate/Competitorn/a
Meas. Tech.In Vitro Contact Cellular Assay
EC50<100±n/a nM
Citation McDonald, AQian, S Therapeutic inhibitory compounds US Patent US10023557 Publication Date 7/17/2018
 
Plasma kallikrein
Name:Plasma kallikrein
Type:Protein
Mol. Mass.:71391.16
Organism:Homo sapiens (Human)
Description:P03952
Residue:638
BDBM283379
NameBDBM283379
Synonyms:N-((1-aminoisoquinolin-6-yl)methyl)-2-((3- chloroquinolin-6-yl)methyl)isonicotinamide US10023557, Example 31 US10308637, Example 179 US9611252, Example 31
TypeSmall organic molecule
Emp. Form.C26H20ClN5O
Mol. Mass.453.923
SMILESNc1nccc2cc(CNC(=O)c3ccnc(Cc4ccc5ncc(Cl)cc5c4)c3)ccc12