Reaction Details
TargetPlasma kallikrein
LigandBDBM283406
Substrate/Competitorn/a
Meas. Tech.In Vitro Contact Cellular Assay
EC50<100±n/a nM
Citation McDonald, AQian, S Therapeutic inhibitory compounds US Patent US10023557 Publication Date 7/17/2018
 
Plasma kallikrein
Name:Plasma kallikrein
Type:Protein
Mol. Mass.:71391.16
Organism:Homo sapiens (Human)
Description:P03952
Residue:638
BDBM283406
NameBDBM283406
Synonyms:6-((4-(((6-amino-2,4-dimethylpyridin-3- yl)methyl)carbamoyl)pyridin-2-yl)methyl)-3- chloroquinoline-8-carboxamide US10266515, Example 58 US11021463, Example 58 | US9611252, Example 58
TypeSmall organic molecule
Emp. Form.C25H23ClN6O2
Mol. Mass.474.942
SMILESCc1cc(N)nc(C)c1CNC(=O)c1ccnc(Cc2cc(C(N)=O)c3ncc(Cl)cc3c2)c1