Reaction Details
TargetPlasma kallikrein
LigandBDBM283447
Substrate/Competitorn/a
Meas. Tech.In Vitro Contact Cellular Assay
EC50<100±n/a nM
Citation McDonald, AQian, S Therapeutic inhibitory compounds US Patent US10023557 Publication Date 7/17/2018
 
Plasma kallikrein
Name:Plasma kallikrein
Type:Protein
Mol. Mass.:71391.16
Organism:Homo sapiens (Human)
Description:P03952
Residue:638
BDBM283447
NameBDBM283447
Synonyms:6-((4-(((6-amino-2,4-dimethylpyridin-3- yl)methyl)carbamoyl)pyridin-2-yl)methyl)-3- chloroquinoline 1-oxide US10266515, Example 99 US11021463, Example 99 | US9611252, Example 99
TypeSmall organic molecule
Emp. Form.C24H22ClN5O2
Mol. Mass.447.917
SMILESCc1cc(N)nc(C)c1CNC(=O)c1ccnc(Cc2ccc3[n+]([O-])cc(Cl)cc3c2)c1