Reaction Details
TargetPlasma kallikrein
LigandBDBM283528
Substrate/Competitorn/a
Meas. Tech.In Vitro Contact Cellular Assay
EC50<100±n/a nM
Citation McDonald, AQian, S Therapeutic inhibitory compounds US Patent US10023557 Publication Date 7/17/2018
 
Plasma kallikrein
Name:Plasma kallikrein
Type:Protein
Mol. Mass.:71391.16
Organism:Homo sapiens (Human)
Description:P03952
Residue:638
BDBM283528
NameBDBM283528
Synonyms:N-((1-amino-5-methylisoquinolin-6-yl)methyl)- 2-((3-chloroquinolin-6- yl)methyl)isonicotinamide US10308637, Example 177
TypeSmall organic molecule
Emp. Form.C27H22ClN5O
Mol. Mass.467.949
SMILESCc1c(CNC(=O)c2ccnc(Cc3ccc4ncc(Cl)cc4c3)c2)ccc2c(N)nccc12