Reaction Details
TargetOrexin receptor type 2
LigandBDBM120777
Substrate/Competitorn/a
Meas. Tech.Radioligand Binding Assay
Ki 0.55±n/a nM
Citation Breslin, MJColeman, PJCox, CDRaheem, ITRoecker, AJSchreier, JD 2,5-disubstituted piperidine orexin receptor antagonists US Patent US8710076 Publication Date 4/29/2014
 
Orexin receptor type 2
Name:Orexin receptor type 2
Type:Protein
Mol. Mass.:50710.53
Organism:Homo sapiens (Human)
Description:O43614
Residue:444
BDBM120777
NameBDBM120777
Synonyms:US8710076, E-2
TypeSmall organic molecule
Emp. Form.C24H22FN5O2
Mol. Mass.431.4622
SMILESC[C@@H]1CC[C@H](CN1C(=O)c1ccccc1-n1nccn1)Oc1ccnc2c(F)cccc12