Reaction Details
TargetcAMP-specific 3',5'-cyclic phosphodiesterase 4A
LigandBDBM120853
Substrate/Competitorn/a
Meas. Tech.Inhibition Assay
pH7.5±n/a
Temperature310.15±n/a K
IC50 1.3±n/a nM
Citation Jarnagin, KAkama, T Boron-containing small molecules US Patent US8716478 Publication Date 5/6/2014
 
cAMP-specific 3',5'-cyclic phosphodiesterase 4A
Name:cAMP-specific 3',5'-cyclic phosphodiesterase 4A
Type:Enzyme
Mol. Mass.:98113.27
Organism:Homo sapiens (Human)
Description:P27815
Residue:886
BDBM120853
NameBDBM120853
Synonyms:US8716478, D239 | US9499570, D239
TypeSmall organic molecule
Emp. Form.C18H16BClN2O5
Mol. Mass.386.594
SMILESOB1OCc2cc(Oc3nc(OCCOC4CC4)c(cc3Cl)C#N)ccc12