Reaction Details
TargetcAMP-specific 3',5'-cyclic phosphodiesterase 4A
LigandBDBM120866
Substrate/Competitorn/a
Meas. Tech.Inhibition Assay
pH7.5±n/a
Temperature310.15±n/a K
IC50 0.25±n/a nM
Citation Jarnagin, KAkama, T Boron-containing small molecules US Patent US8716478 Publication Date 5/6/2014
 
cAMP-specific 3',5'-cyclic phosphodiesterase 4A
Name:cAMP-specific 3',5'-cyclic phosphodiesterase 4A
Type:Enzyme
Mol. Mass.:98113.27
Organism:Homo sapiens (Human)
Description:P27815
Residue:886
BDBM120866
NameBDBM120866
Synonyms:US8716478, D253 | US9499570, D253
TypeSmall organic molecule
Emp. Form.C18H16BClN2O5
Mol. Mass.386.594
SMILESCC(=O)CCCOc1nc(Oc2ccc3B(O)OCc3c2)c(cc1Cl)C#N