Reaction Details
TargetSerine/threonine-protein kinase Chk1
LigandBDBM120886
Substrate/Competitorn/a
Meas. Tech.Inhibiting Assay
pH7.5±n/a
IC50 1.2±n/a nM
Citation Boyle, RGWalker, DWBoyce, RJ Pharmaceutical compounds US Patent US8716287 Publication Date 5/6/2014
 
Serine/threonine-protein kinase Chk1
Name:Serine/threonine-protein kinase Chk1
Type:Enzyme Catalytic Domain
Mol. Mass.:54443.02
Organism:Homo sapiens (Human)
Description:gi_166295192
Residue:476
BDBM120886
NameBDBM120886
Synonyms:US8716287, 19
TypeSmall organic molecule
Emp. Form.C22H20ClFN6O2
Mol. Mass.454.885
SMILESCOc1cc(CCNCc2cccc(F)c2)c(Cl)cc1NC(=O)Nc1cnc(cn1)C#N