Reaction Details
TargetSerine/threonine-protein kinase Chk1
LigandBDBM120909
Substrate/Competitorn/a
Meas. Tech.Inhibiting Assay
pH7.5±n/a
IC50 0.45±n/a nM
Citation Boyle, RGWalker, DWBoyce, RJ Pharmaceutical compounds US Patent US8716287 Publication Date 5/6/2014
 
Serine/threonine-protein kinase Chk1
Name:Serine/threonine-protein kinase Chk1
Type:Enzyme Catalytic Domain
Mol. Mass.:54443.02
Organism:Homo sapiens (Human)
Description:gi_166295192
Residue:476
BDBM120909
NameBDBM120909
Synonyms:US8716287, 42
TypeSmall organic molecule
Emp. Form.C22H20BrFN6O2
Mol. Mass.499.336
SMILESCOc1cc(CCNCc2ccc(F)cc2)c(Br)cc1NC(=O)Nc1cnc(cn1)C#N