Reaction Details
TargetSerine/threonine-protein kinase Chk1
LigandBDBM120912
Substrate/Competitorn/a
Meas. Tech.Inhibiting Assay
pH7.5±n/a
IC50 1.2±n/a nM
Citation Boyle, RGWalker, DWBoyce, RJ Pharmaceutical compounds US Patent US8716287 Publication Date 5/6/2014
 
Serine/threonine-protein kinase Chk1
Name:Serine/threonine-protein kinase Chk1
Type:Enzyme Catalytic Domain
Mol. Mass.:54443.02
Organism:Homo sapiens (Human)
Description:gi_166295192
Residue:476
BDBM120912
NameBDBM120912
Synonyms:US8716287, 45
TypeSmall organic molecule
Emp. Form.C23H22ClFN6O2
Mol. Mass.468.911
SMILESCCOc1cc(CCNCc2ccc(F)cc2)c(Cl)cc1NC(=O)Nc1cnc(cn1)C#N