Reaction Details
TargetSerine/threonine-protein kinase Chk1
LigandBDBM120913
Substrate/Competitorn/a
Meas. Tech.Inhibiting Assay
pH7.5±n/a
IC50 0.32±n/a nM
Citation Boyle, RGWalker, DWBoyce, RJ Pharmaceutical compounds US Patent US8716287 Publication Date 5/6/2014
 
Serine/threonine-protein kinase Chk1
Name:Serine/threonine-protein kinase Chk1
Type:Enzyme Catalytic Domain
Mol. Mass.:54443.02
Organism:Homo sapiens (Human)
Description:gi_166295192
Residue:476
BDBM120913
NameBDBM120913
Synonyms:US8716287, 46
TypeSmall organic molecule
Emp. Form.C24H24ClFN6O2
Mol. Mass.482.938
SMILESCC(C)Oc1cc(CCNCc2ccc(F)cc2)c(Cl)cc1NC(=O)Nc1cnc(cn1)C#N