Reaction Details
TargetSerine/threonine-protein kinase Chk1
LigandBDBM120917
Substrate/Competitorn/a
Meas. Tech.Inhibiting Assay
pH7.5±n/a
IC50 0.45±n/a nM
Citation Boyle, RGWalker, DWBoyce, RJ Pharmaceutical compounds US Patent US8716287 Publication Date 5/6/2014
 
Serine/threonine-protein kinase Chk1
Name:Serine/threonine-protein kinase Chk1
Type:Enzyme Catalytic Domain
Mol. Mass.:54443.02
Organism:Homo sapiens (Human)
Description:gi_166295192
Residue:476
BDBM120917
NameBDBM120917
Synonyms:US8716287, 50
TypeSmall organic molecule
Emp. Form.C27H31ClN8O2
Mol. Mass.535.04
SMILESCOc1cc(CCNCc2ccc(cc2)N2CCN(C)CC2)c(Cl)cc1NC(=O)Nc1cnc(cn1)C#N