Reaction Details
TargetCyclin-dependent kinase 9
LigandBDBM120936
Substrate/Competitorn/a
Meas. Tech.In Vitro Kinase Inhibition Assays
pH7.5±n/a
IC50 0.019±n/a nM
Commentsextracted
Citation Allgeier, HAugustin, MMüller, AZeitlmann, LMarquardt, APleiss, MAHeiser, UNiestroj, AJ Inhibitors of protein kinases US Patent US8716296 Publication Date 5/6/2014
 
Cyclin-dependent kinase 9
Name:Cyclin-dependent kinase 9
Type:Enzyme Subunit
Mol. Mass.:42789.13
Organism:Homo sapiens (Human)
Description:n/a
Residue:372
BDBM120936
NameBDBM120936
Synonyms:US8716296, 5 | US8716296, 6
TypeSmall organic molecule
Emp. Form.C17H18N4O3
Mol. Mass.326.3498
SMILESCOc1ccccc1-c1cc(NC(=O)C2CCC(=O)NC2)ncn1