Reaction Details
TargetProkineticin receptor 2
LigandBDBM121070
Substrate/Competitorn/a
Meas. Tech.Calcium Mobilization Assay
Temperature310.15±n/a K
Ki 0.81±n/a nM
Commentsextracted
Citation Zhou, QLi, JHuang, Q Prokineticin receptor antagonists and uses thereof US Patent US8722896 Publication Date 5/13/2014
 
Prokineticin receptor 2
Name:Prokineticin receptor 2
Synonyms:Prokineticin receptor 2 (PRK2)
Type:Enzyme
Mol. Mass.:44473.96
Organism:Cricetulus griseus (Chinese hamster)
Description:G3H407
Residue:391
BDBM121070
NameBDBM121070
Synonyms:US8722896, (-)-(3R)-1-(2-Methoxybenzyl)- N-(9-fluoro-3,4-dihydro-2H-1,5- benzodioxepin-7-ylmethyl)-N- isobutylpyrrolidine-3- carboxamide
TypeSmall organic molecule
Emp. Form.C27H35FN2O4
Mol. Mass.470.5762
SMILESCOc1ccccc1CN1CC[C@H](C1)C(=O)N(CC(C)C)Cc1cc(F)c2OCCCOc2c1