Reaction Details
TargetProkineticin receptor 2
LigandBDBM121088
Substrate/Competitorn/a
Meas. Tech.Calcium Mobilization Assay
Temperature310.15±n/a K
Ki 1.03±n/a nM
Commentsextracted
Citation Zhou, QLi, JHuang, Q Prokineticin receptor antagonists and uses thereof US Patent US8722896 Publication Date 5/13/2014
 
Prokineticin receptor 2
Name:Prokineticin receptor 2
Synonyms:Prokineticin receptor 2 (PRK2)
Type:Enzyme
Mol. Mass.:44473.96
Organism:Cricetulus griseus (Chinese hamster)
Description:G3H407
Residue:391
BDBM121088
NameBDBM121088
Synonyms:US8722896, (-)-(3R)-1-(3-Methoxybenzyl)- N-(9-chloro-3,4-dihydro-2H-1,5- benzodioxepin-7-ylmethyl)-N- isobutylpyrrolidine-3- carboxamide
TypeSmall organic molecule
Emp. Form.C27H35ClN2O4
Mol. Mass.487.031
SMILESCOc1cccc(CN2CC[C@H](C2)C(=O)N(CC(C)C)Cc2cc(Cl)c3OCCCOc3c2)c1