Reaction Details
TargetProkineticin receptor 2
LigandBDBM121261
Substrate/Competitorn/a
Meas. Tech.Calcium Mobilization Assay
Temperature310.15±n/a K
Ki 1.24±n/a nM
Commentsextracted
Citation Zhou, QLi, JHuang, Q Prokineticin receptor antagonists and uses thereof US Patent US8722896 Publication Date 5/13/2014
 
Prokineticin receptor 2
Name:Prokineticin receptor 2
Synonyms:Prokineticin receptor 2 (PRK2)
Type:Enzyme
Mol. Mass.:44473.96
Organism:Cricetulus griseus (Chinese hamster)
Description:G3H407
Residue:391
BDBM121261
NameBDBM121261
Synonyms:US8722896, (-)-(3R)-1-(N-methyl-indol-4- ylmethyl)-N-(9-chloro-3,4- dihydro-2H-1,5-benzodioxepin- 7-ylmethyl)-N- isobutylpiperidine-3- carboxamide
TypeSmall organic molecule
Emp. Form.C30H38ClN3O3
Mol. Mass.524.094
SMILESCC(C)CN(Cc1cc(Cl)c2OCCCOc2c1)C(=O)C1CCCN(Cc2cccc3n(C)ccc23)C1