Reaction Details
TargetProkineticin receptor 1
LigandBDBM121324
Substrate/Competitorn/a
Meas. Tech.Calcium Mobilization Assay
Temperature310.15±n/a K
Ki 1.15±n/a nM
Commentsextracted
Citation Zhou, QLi, JHuang, Q Prokineticin receptor antagonists and uses thereof US Patent US8722896 Publication Date 5/13/2014
 
Prokineticin receptor 1
Name:Prokineticin receptor 1
Synonyms:Prokineticin receptor 1 (PRK1)
Type:Enzyme
Mol. Mass.:44908.29
Organism:Cricetulus griseus (Chinese hamster)
Description:G3HIE5
Residue:399
BDBM121324
NameBDBM121324
Synonyms:US8722896, (-)-(2R)-2-Methyl-3-((3- hydroxy)benzylamino)-N-(9- chloro-3,3-difluoro-3,4-dihydro- 2H-1,5-benzodioxepin-7- ylmethyl)-N- isobutylpropanamide
TypeSmall organic molecule
Emp. Form.C25H33ClN2O4
Mol. Mass.460.994
SMILESCC(C)CN(Cc1cc(Cl)c2OCCCOc2c1)C(=O)[C@H](C)CNCc1cccc(O)c1