Reaction Details
TargetVascular endothelial growth factor receptor 1
LigandBDBM121388
Substrate/Competitorn/a
Meas. Tech.Homogenous Time-Resolved Fluorescence Assay (HTRF)
pH7.1±n/a
Temperature298.15±n/a K
IC50 2.04±n/a nM
Commentsextracted
Citation Michaelides, MRFrey, RCurtin, M Thieno[3,2-C]pyridine kinase inhibitors with improved CYP safety profile US Patent US8722890 Publication Date 5/13/2014
 
Vascular endothelial growth factor receptor 1
Name:Vascular endothelial growth factor receptor 1
Type:Receptor Tyrosine Kinase
Mol. Mass.:150800.23
Organism:Homo sapiens (Human)
Description:P17948
Residue:1338
BDBM121388
NameBDBM121388
Synonyms:US8722890, 3
TypeSmall organic molecule
Emp. Form.C27H26N6O2S
Mol. Mass.498.599
SMILESC[C@H](O)Cn1cc(cn1)-c1cnc(N)c2c(csc12)-c1ccc(NC(=O)Nc2cccc(C)c2)cc1