Reaction Details
TargetHistone-lysine N-methyltransferase, H3 lysine-79 specific
LigandBDBM121393
Substrate/Competitorn/a
Meas. Tech.Biochemical Assay
pH8±n/a
Temperature298.15±n/a K
IC50<10±n/a nM
Commentsextracted
Citation Chesworth, RKuntz, KWOlhava, EJPatane, MA 7-deazapurine modulators of histone methyltransferase, and methods of use thereof US Patent US8722877 Publication Date 5/13/2014
 
Histone-lysine N-methyltransferase, H3 lysine-79 specific
Name:Histone-lysine N-methyltransferase, H3 lysine-79 specific
Type:Protein
Mol. Mass.:184911.91
Organism:Homo sapiens (Human)
Description:Q8TEK3
Residue:1537
BDBM121393
NameBDBM121393
Synonyms:US8722877, 18
TypeSmall organic molecule
Emp. Form.C29H41N9O4
Mol. Mass.579.6937
SMILESCC(C)N(CCCNC(=O)Nc1nc2ccc(cc2[nH]1)C(C)(C)C)CC1O[C@H]([C@H](O)[C@@H]1O)n1ccc2c(N)ncnc12