Reaction Details
TargetD(3) dopamine receptor
LigandBDBM121463
Substrate/Competitorn/a
Meas. Tech.Radioligand Binding Assay
Ki 1.69±n/a nM
Citation Rodriguez Sarmiento, RMWichmann, J Benzodioxole piperazine compounds US Patent US8722683 Publication Date 5/13/2014
 
D(3) dopamine receptor
Name:D(3) dopamine receptor
Type:n/a
Mol. Mass.:44243.43
Organism:Homo sapiens (Human)
Description:n/a
Residue:400
BDBM121463
NameBDBM121463
Synonyms:US8722683, 10
TypeSmall organic molecule
Emp. Form.C21H31N3O4
Mol. Mass.389.4885
SMILESOCC(=O)N[C@H]1CC[C@H](CCN2CCN(CC2)c2cccc3OCOc23)CC1