Reaction Details
TargetXanthine dehydrogenase/oxidase
LigandBDBM121541
Substrate/Competitorn/a
Meas. Tech.Inhibition Activity
IC50 5.4±n/a nM
Citation Song, JUKim, GTChoi, SPJung, CKPark, DSChoi, ESKim, THPark, HJPark, WSPark, HSKoo, KCArtemov, V Compounds effective as xanthine oxidase inhibitors, method for preparing the same, and pharmaceutical composition containing the same US Patent US8729273 Publication Date 5/20/2014
 
Xanthine dehydrogenase/oxidase
Name:Xanthine dehydrogenase/oxidase
Type:Protein
Mol. Mass.:146809.00
Organism:Bos taurus (Bovine)
Description:P80457
Residue:1332
BDBM121541
NameBDBM121541
Synonyms:US8729273, 11
TypeSmall organic molecule
Emp. Form.C17H14N4O3
Mol. Mass.322.3181
SMILESOC(=O)c1cnn(c1)-c1ccc2n(cc(C#N)c2c1)C1CCOC1