Reaction Details
TargetXanthine dehydrogenase/oxidase
LigandBDBM121547
Substrate/Competitorn/a
Meas. Tech.Inhibition Activity
IC50 4.6±n/a nM
Citation Song, JUKim, GTChoi, SPJung, CKPark, DSChoi, ESKim, THPark, HJPark, WSPark, HSKoo, KCArtemov, V Compounds effective as xanthine oxidase inhibitors, method for preparing the same, and pharmaceutical composition containing the same US Patent US8729273 Publication Date 5/20/2014
 
Xanthine dehydrogenase/oxidase
Name:Xanthine dehydrogenase/oxidase
Type:Protein
Mol. Mass.:146809.00
Organism:Bos taurus (Bovine)
Description:P80457
Residue:1332
BDBM121547
NameBDBM121547
Synonyms:US8729273, 17
TypeSmall organic molecule
Emp. Form.C15H14N4O4
Mol. Mass.314.2961
SMILESCC(C)n1cc([N+]([O-])=O)c2cc(ccc12)-n1cc(cn1)C(O)=O